iOS Question Error building an App with In-App capability in using ios development profile

Markos

Well-Known Member
Licensed User
Longtime User
Hi All,

I am trying to build using B4Buildserver and test my App with In-App capability. I did the following approaches from a provisioning profile creation

1) I created the profile with wildcard identifier and got this response from the server below

B4X:
B4i Version: 10.00
Parsing code.    (0.08s)
Building folders structure.    (0.03s)
Compiling code.    (0.08s)
Compiling layouts code.    (0.03s)
Building Xcode project.    (0.22s)
Preparing project for builder.    (0.26s)
    Project size: 1.70 MB
Sending data to remote compiler.    Error
Out: Command line invocation:
    /Applications/Xcode.app/Contents/Developer/usr/bin/xcodebuild -configuration Release "PRODUCT_NAME=Progwhiz ID Maker" CONFIGURATION_BUILD_DIR=/Users/progwhizmac3/Desktop/b4i_v5/B4iBuildServer/UploadedProjects/<user id>/Payload "CODE_SIGN_IDENTITY=iPhone Developer: Mark Raymond (A8QVDNS5BQ)" "OTHER_CODE_SIGN_FLAGS=--keychain <user id>" PROVISIONING_PROFILE=e9d6119e-f8c0-423f-9b23-40229e03da8d -arch arm64

Build settings from command line:
    ARCHS = arm64
    CODE_SIGN_IDENTITY = iPhone Developer: Mark Raymond (A8QVDNS5BQ)
    CONFIGURATION_BUILD_DIR = /Users/progwhizmac3/Desktop/b4i_v5/B4iBuildServer/UploadedProjects/<user id>/Payload
    OTHER_CODE_SIGN_FLAGS = --keychain <user id>
    PRODUCT_NAME = Progwhiz ID Maker
    PROVISIONING_PROFILE = e9d6119e-f8c0-423f-9b23-40229e03da8d

note: Using codesigning identity override: iPhone Developer: Mark Raymond (A8QVDNS5BQ)
ComputePackagePrebuildTargetDependencyGraph

Prepare packages

CreateBuildRequest

SendProjectDescription

CreateBuildOperation

ComputeTargetDependencyGraph
note: Building targets in dependency order
note: Target dependency graph (1 target)
    Target 'B4iProject' in project 'B4iProject' (no dependencies)

GatherProvisioningInputs

CreateBuildDescription

ExecuteExternalTool /Applications/Xcode.app/Contents/Developer/Toolchains/XcodeDefault.xctoolchain/usr/bin/clang -v -E -dM -isysroot /Applications/Xcode.app/Contents/Developer/Platforms/iPhoneOS.platform/Developer/SDKs/iPhoneOS26.2.sdk -x c -c /dev/null

ExecuteExternalTool /Applications/Xcode.app/Contents/Developer/Toolchains/XcodeDefault.xctoolchain/usr/bin/clang -v -E -dM -arch arm64 -isysroot /Applications/Xcode.app/Contents/Developer/Platforms/iPhoneOS.platform/Developer/SDKs/iPhoneOS26.2.sdk -x objective-c -c /dev/null

ExecuteExternalTool /Applications/Xcode.app/Contents/Developer/usr/bin/ibtool --version --output-format xml1

ExecuteExternalTool /Applications/Xcode.app/Contents/Developer/Toolchains/XcodeDefault.xctoolchain/usr/bin/clang -v -E -dM -arch arm64 -isysroot /Applications/Xcode.app/Contents/Developer/Platforms/iPhoneOS.platform/Developer/SDKs/iPhoneOS26.2.sdk -x c -c /dev/null

ExecuteExternalTool /Applications/Xcode.app/Contents/Developer/usr/bin/actool --print-asset-tag-combinations --output-format xml1 /Users/progwhizmac3/Desktop/b4i_v5/B4iBuildServer/UploadedProjects/<user id>/Images.xcassets

ExecuteExternalTool /Applications/Xcode.app/Contents/Developer/usr/bin/actool --version --output-format xml1

ExecuteExternalTool /Applications/Xcode.app/Contents/Developer/Toolchains/XcodeDefault.xctoolchain/usr/bin/ld -version_details

Build description signature: ce6629462571044378c1026deac44cf1
Build description path: /Users/progwhizmac3/Desktop/b4i_v5/B4iBuildServer/UploadedProjects/<user id>/build/XCBuildData/ce6629462571044378c1026deac44cf1.xcbuilddata
/Users/progwhizmac3/Desktop/b4i_v5/B4iBuildServer/UploadedProjects/<user id>/B4iProject.xcodeproj: error: Provisioning profile "ProgwhiziOSnew" doesn't include the In-App Purchase capability. (in target 'B4iProject' from project 'B4iProject')

Error: ** BUILD FAILED **

2) I tried using the explicit app identifier then I got this error below

B4X:
B4i Version: 10.00
Parsing code.    (0.08s)
Building folders structure.    (0.04s)
Compiling code.    (0.10s)
Compiling layouts code.    (0.00s)
Building Xcode project.    (0.23s)
Preparing project for builder.    (0.28s)
    Project size: 1.70 MB
Sending data to remote compiler.    Error
B4i line: 349
mainscroll.Initialize(\
invalid suffix 'x' on integer constant

Out: Command line invocation:
    /Applications/Xcode.app/Contents/Developer/usr/bin/xcodebuild -configuration Release "PRODUCT_NAME=Progwhiz ID Maker" CONFIGURATION_BUILD_DIR=/Users/progwhizmac3/Desktop/b4i_v5/B4iBuildServer/UploadedProjects/<user id>/Payload "CODE_SIGN_IDENTITY=iPhone Developer: Mark Raymond (A8QVDNS5BQ)" "OTHER_CODE_SIGN_FLAGS=--keychain <user id>" PROVISIONING_PROFILE=ae61428c-b78b-4099-829d-99e4e629d2f7 -arch arm64

Build settings from command line:
    ARCHS = arm64
    CODE_SIGN_IDENTITY = iPhone Developer: Mark Raymond (A8QVDNS5BQ)
    CONFIGURATION_BUILD_DIR = /Users/progwhizmac3/Desktop/b4i_v5/B4iBuildServer/UploadedProjects/<user id>/Payload
    OTHER_CODE_SIGN_FLAGS = --keychain <user id>
    PRODUCT_NAME = Progwhiz ID Maker
    PROVISIONING_PROFILE = ae61428c-b78b-4099-829d-99e4e629d2f7

note: Using codesigning identity override: iPhone Developer: Mark Raymond (A8QVDNS5BQ)
ComputePackagePrebuildTargetDependencyGraph

Prepare packages

CreateBuildRequest

SendProjectDescription

CreateBuildOperation

ComputeTargetDependencyGraph
note: Building targets in dependency order
note: Target dependency graph (1 target)
    Target 'B4iProject' in project 'B4iProject' (no dependencies)

GatherProvisioningInputs

CreateBuildDescription

ExecuteExternalTool /Applications/Xcode.app/Contents/Developer/Toolchains/XcodeDefault.xctoolchain/usr/bin/clang -v -E -dM -isysroot /Applications/Xcode.app/Contents/Developer/Platforms/iPhoneOS.platform/Developer/SDKs/iPhoneOS26.2.sdk -x c -c /dev/null

ExecuteExternalTool /Applications/Xcode.app/Contents/Developer/Toolchains/XcodeDefault.xctoolchain/usr/bin/clang -v -E -dM -arch arm64 -isysroot /Applications/Xcode.app/Contents/Developer/Platforms/iPhoneOS.platform/Developer/SDKs/iPhoneOS26.2.sdk -x objective-c -c /dev/null

**Skpped other output ***

    /Applications/Xcode.app/Contents/Developer/Toolchains/XcodeDefault.xctoolchain/usr/bin/clang -x objective-c -ivfsstatcache /var/folders/x8/b9w239r53_q4jkdy_7fjmlw80000gn/C/com.apple.DeveloperTools/26.3-17C529/Xcode/SDKStatCaches.noindex/iphoneos26.2-23C57-3794476bd08197c3e2abd9bb477ef7f7.sdkstatcache -fmessage-length\=0 -fdiagnostics-show-note-include-stack -fmacro-backtrace-limit\=0 -fno-color-diagnostics -fmodules-prune-interval\=86400 -fmodules-prune-after\=345600 -fbuild-session-file\=/var/folders/x8/b9w239r53_q4jkdy_7fjmlw80000gn/C/org.llvm.clang/ModuleCache.noindex/Session.modulevalidation -fmodules-validate-once-per-build-session -Wnon-modular-include-in-framework-module -Werror\=non-modular-include-in-framework-module -Wno-trigraphs -Wno-missing-field-initializers -Wno-missing-prototypes -Werror\=return-type -Wno-implicit-atomic-properties -Werror\=deprecated-objc-isa-usage -Wno-objc-interface-ivars -Werror\=objc-root-class -Wno-arc-repeated-use-of-weak -Wduplicate-method-match -Wno-missing-braces -Wparentheses -Wswitch -Wunused-function -Wno-unused-label -Wno-unused-parameter -Wunused-variable -Wunused-value -Wempty-body -Wuninitialized -Wconditional-uninitialized -Wno-unknown-pragmas -Wno-shadow -Wno-four-char-constants -Wno-conversion -Wconstant-conversion -Wint-conversion -Wbool-conversion -Wenum-conversion -Wno-float-conversion -Wno-non-literal-null-conversion -Wno-objc-literal-conversion -Wshorten-64-to-32 -Wpointer-sign -Wno-newline-eof -Wno-selector -Wno-strict-selector-match -Wundeclared-selector -Wno-deprecated-implementations -Wno-implicit-fallthrough -fstrict-aliasing -Wprotocol -Wdeprecated-declarations -Wno-sign-conversion -Wno-infinite-recursion -Wno-comma -Wno-block-capture-autoreleasing -Wno-strict-prototypes -Wno-semicolon-before-method-body @/Users/progwhizmac3/Desktop/b4i_v5/B4iBuildServer/UploadedProjects/<user id>/build/B4iProject.build/Release-iphoneos/B4iProject.build/Objects-normal/arm64/e6072d4f65d7061329687fe24e3d63a7-common-args.resp -MMD -MT dependencies -MF /Users/progwhizmac3/Desktop/b4i_v5/B4iBuildServer/UploadedProjects/<user id>/build/B4iProject.build/Release-iphoneos/B4iProject.build/Objects-normal/arm64/b4i_main.d --serialize-diagnostics /Users/progwhizmac3/Desktop/b4i_v5/B4iBuildServer/UploadedProjects/<user id>/build/B4iProject.build/Release-iphoneos/B4iProject.build/Objects-normal/arm64/b4i_main.dia -c /Users/progwhizmac3/Desktop/b4i_v5/B4iBuildServer/UploadedProjects/<user id>/B4iProject/b4i_main.m -o /Users/progwhizmac3/Desktop/b4i_v5/B4iBuildServer/UploadedProjects/<user id>/build/B4iProject.build/Release-iphoneos/B4iProject.build/Objects-normal/arm64/b4i_main.o
/Users/progwhizmac3/Desktop/b4i_v5/B4iBuildServer/UploadedProjects/<user id>/B4iProject/b4i_main.m:2365:66: error: invalid suffix 'x' on integer constant
 2365 | [self->__mainscroll Initialize:self.bi :@"mainscroll" :(int) (100x) :(int) ([self->___c PerYToCurrent:(float) (100)])];
      |                                                                  ^
/Users/progwhizmac3/Desktop/b4i_v5/B4iBuildServer/UploadedProjects/<user id>/B4iProject/b4i_main.m:5123:23: warning: initializing 'const __strong id<B4IIterable>' with an expression of incompatible type 'B4IMap *__strong'
 5123 | const id<B4IIterable> group4 = _products;
      |                       ^        ~~~~~~~~~
/Users/progwhizmac3/Desktop/b4i_v5/B4iBuildServer/UploadedProjects/<user id>/B4iProject/b4i_main.m:5304:8: warning: passing 'const void *' to parameter of type 'void * _Nullable' discards qualifiers [-Wincompatible-pointer-types-discards-qualifiers]
 5304 |        data.bytes,
      |        ^~~~~~~~~~
In module 'AVFoundation' imported from /Users/progwhizmac3/Desktop/b4i_v5/B4iBuildServer/UploadedProjects/<user id>/B4iProject/b4i_main.h:13:
In module 'CoreMedia' imported from /Applications/Xcode.app/Contents/Developer/Platforms/iPhoneOS.platform/Developer/SDKs/iPhoneOS26.2.sdk/System/Library/Frameworks/AVFoundation.framework/Headers/AVContentKeySession.h:10:
In module 'CoreGraphics' imported from /Applications/Xcode.app/Contents/Developer/Platforms/iPhoneOS.platform/Developer/SDKs/iPhoneOS26.2.sdk/System/Library/Frameworks/CoreMedia.framework/Headers/CMFormatDescription.h:27:
/Applications/Xcode.app/Contents/Developer/Platforms/iPhoneOS.platform/Developer/SDKs/iPhoneOS26.2.sdk/System/Library/Frameworks/CoreGraphics.framework/Headers/CGBitmapContext.h:77:75: note: passing argument to parameter 'data' here
   77 | CG_EXTERN CGContextRef __nullable CGBitmapContextCreate(void * __nullable data,
      |                                                                           ^
/Users/progwhizmac3/Desktop/b4i_v5/B4iBuildServer/UploadedProjects/<user id>/B4iProject/b4i_main.m:5310:5: warning: implicit conversion from enumeration type 'enum CGImageAlphaInfo' to different enumeration type 'CGBitmapInfo' (aka 'enum CGBitmapInfo') [-Wenum-conversion]
 5303 |    CGContextRef bitmapContext = CGBitmapContextCreate(
      |                                 ~~~~~~~~~~~~~~~~~~~~~
 5304 |        data.bytes,
 5305 |     width,
 5306 |     height,
 5307 |     8,
 5308 |     4*width,
 5309 |     colorSpace,
 5310 |     kCGImageAlphaNoneSkipLast);
      |     ^~~~~~~~~~~~~~~~~~~~~~~~~
3 warnings and 1 error generated.
Failed frontend command:
/Applications/Xcode.app/Contents/Developer/Toolchains/XcodeDefault.xctoolchain/usr/bin/clang -cc1 -Wundef-prefix\=TARGET_OS_ -fdiagnostics-show-note-include-stack -fmacro-backtrace-limit\=0 -ferror-limit 19 -serialize-diagnostic-file /Users/progwhizmac3/Desktop/b4i_v5/B4iBuildServer/UploadedProjects/<user id>/build/B4iProject.build/Release-iphoneos/B4iProject.build/Objects-normal/arm64/b4i_main.dia -Wdeprecated-objc-isa-usage -Werror\=deprecated-objc-isa-usage -Werror\=implicit-function-declaration -Wnon-modular-include-in-framework-module -Werror\=non-modular-include-in-framework-module -Wno-trigraphs -Wno-missing-field-initializers -Wno-missing-prototypes -Werror\=return-type -Wno-implicit-atomic-properties -Werror\=deprecated-objc-isa-usage -Wno-objc-interface-ivars -Werror\=objc-root-class -Wno-arc-repeated-use-of-weak -Wduplicate-method-match -Wno-missing-braces -Wparentheses -Wswitch -Wunused-function -Wno-unused-label -Wno-unused-parameter -Wunused-variable -Wunused-value -Wempty-body -Wuninitialized -Wconditional-uninitialized -Wno-unknown-pragmas -Wno-shadow -Wno-four-char-constants -Wno-conversion -Wconstant-conversion -Wint-conversion -Wbool-conversion -Wenum-conversion -Wno-float-conversion -Wno-non-literal-null-conversion -Wno-objc-literal-conversion -Wshorten-64-to-32 -Wpointer-sign -Wno-newline-eof -Wno-selector -Wno-strict-selector-match -Wundeclared-selector -Wno-deprecated-implementations -Wno-implicit-fallthrough -Wprotocol -Wdeprecated-declarations -Wno-sign-conversion -Wno-infinite-recursion -Wno-comma -Wno-block-capture-autoreleasing -Wno-strict-prototypes -Wno-semicolon-before-method-body -Wno-reorder-init-list -Wno-implicit-int-float-conversion -Wno-c99-designator -Wno-final-dtor-non-final-class -Wno-extra-semi-stmt -Wno-misleading-indentation -Wno-quoted-include-in-framework-header -Wno-implicit-fallthrough -Wno-enum-enum-conversion -Wno-enum-float-conversion -Wno-elaborated-enum-base -fmodule-map-file\=/Applications/Xcode.app/Contents/Developer/Platforms/iPhoneOS.platform/Developer/SDKs/iPhoneOS.sdk/System/Library/Frameworks/AVFoundation.framework/Modules/module.modulemap -fmodule-map-file\=/Users/progwhizmac3/Desktop/b4i_v5/B4iBuildServer/UploadedProjects/<user id>/Payload/iCore.framework/Modules/module.modulemap -fmodule-map-file\=/Users/progwhizmac3/Desktop/b4i_v5/B4iBuildServer/UploadedProjects/<user id>/Payload/iBarcode.framework/Modules/module.modulemap -fmodule-map-file\=/Users/progwhizmac3/Desktop/b4i_v5/B4iBuildServer/UploadedProjects/<user id>/Payload/iHUD.framework/Modules/module.modulemap -fmodule-map-file\=/Users/progwhizmac3/Desktop/b4i_v5/B4iBuildServer/UploadedProjects/<user id>/Payload/iJSON.framework/Modules/module.modulemap -fmodule-map-file\=/Users/progwhizmac3/Desktop/b4i_v5/B4iBuildServer/UploadedProjects/<user id>/Payload/iMedia.framework/Modules/module.modulemap -fmodule-map-file\=/Users/progwhizmac3/Desktop/b4i_v5/B4iBuildServer/UploadedProjects/<user id>/Payload/iNetwork.framework/Modules/module.modulemap -fmodule-map-file\=/Users/progwhizmac3/Desktop/b4i_v5/B4iBuildServer/UploadedProjects/<user id>/Payload/iStringUtils.framework/Modules/module.modulemap -fmodule-map-file\=/Users/progwhizmac3/Desktop/b4i_v5/B4iBuildServer/UploadedProjects/<user id>/Payload/iUI8.framework/Modules/module.modulemap -fmodule-map-file\=/Users/progwhizmac3/Desktop/b4i_v5/B4iBuildServer/UploadedProjects/<user id>/Payload/iXUI.framework/Modules/module.modulemap -fmodule-map-file\=/Users/progwhizmac3/Desktop/b4i_v5/B4iBuildServer/UploadedProjects/<user id>/Payload/StringLib.framework/Modules/module.modulemap -fmodule-map-file\=/Users/progwhizmac3/Desktop/b4i_v5/B4iBuildServer/UploadedProjects/<user id>/Payload/xCustomListView.framework/Modules/module.modulemap -fmodule-map-file\=/Applications/Xcode.app/Contents/Developer/Platforms/iPhoneOS.platform/Developer/SDKs/iPhoneOS.sdk/System/Library/Frameworks/StoreKit.framework/Modules/module.modulemap -fmodule-map-file\=/Users/progwhizmac3/Desktop/b4i_v5/B4iBuildServer/UploadedProjects/<user id>/Payload/iStore.framework/Modules/module.modulemap -fmodule-map-file\=/Users/progwhizmac3/Desktop/b4i_v5/B4iBuildServer/UploadedProjects/<user id>/Payload/iHttp.framework/Modules/module.modulemap -fmodule-map-file\=/Applications/Xcode.app/Contents/Developer/Platforms/iPhoneOS.platform/Developer/SDKs/iPhoneOS.sdk/System/Library/Frameworks/LocalAuthentication.framework/Modules/module.modulemap -o /Users/progwhizmac3/Desktop/b4i_v5/B4iBuildServer/UploadedProjects/<user id>/build/B4iProject.build/Release-iphoneos/B4iProject.build/Objects-normal/arm64/b4i_main.o -disable-free -emit-obj -x objective-c /Users/progwhizmac3/Desktop/b4i_v5/B4iBuildServer/UploadedProjects/<user id>/B4iProject/b4i_main.m -target-abi darwinpcs -target-cpu apple-a7 -target-feature +zcm -target-feature +zcz -target-feature +v8a -target-feature +aes -target-feature +fp-armv8 -target-feature +neon -target-feature +perfmon -target-feature +sha2 -triple arm64-apple-ios16.0.0 -target-linker-version 1230.1 -target-sdk-version\=26.2 -fmodules-validate-system-headers -fno-modulemap-allow-subdirectory-search -isysroot /Applications/Xcode.app/Contents/Developer/Platforms/iPhoneOS.platform/Developer/SDKs/iPhoneOS26.2.sdk -resource-dir /Applications/Xcode.app/Contents/Developer/Toolchains/XcodeDefault.xctoolchain/usr/lib/clang/17 -fmodule-format\=obj -fmodule-file\=AVFoundation\=/Users/progwhizmac3/Desktop/b4i_v5/B4iBuildServer/UploadedProjects/<user id>/build/ExplicitPrecompiledModules/AVFoundation-4JY7I7APY2YTKF1WCA0WDH3MA.pcm -fmodule-file\=LocalAuthentication\=/Users/progwhizmac3/Desktop/b4i_v5/B4iBuildServer/UploadedProjects/<user id>/build/ExplicitPrecompiledModules/LocalAuthentication-7D3Y1TDRBAGG2IM5PXH6LZOJY.pcm -fmodule-file\=StoreKit\=/Users/progwhizmac3/Desktop/b4i_v5/B4iBuildServer/UploadedProjects/<user id>/build/ExplicitPrecompiledModules/StoreKit-8IY15K54NJSSKLT8EYYSFU0HA.pcm -fmodule-file\=StringLib\=/Users/progwhizmac3/Desktop/b4i_v5/B4iBuildServer/UploadedProjects/<user id>/build/ExplicitPrecompiledModules/StringLib-EJ77CO1WIZ7VV7GDT03JTPSGN.pcm -fmodule-file\=iBarcode\=/Users/progwhizmac3/Desktop/b4i_v5/B4iBuildServer/UploadedProjects/<user id>/build/ExplicitPrecompiledModules/iBarcode-46YTI8U6JERC1U248YND1DEF1.pcm -fmodule-file\=iCore\=/Users/progwhizmac3/Desktop/b4i_v5/B4iBuildServer/UploadedProjects/<user id>/build/ExplicitPrecompiledModules/iCore-9FFKUEWP0XTXC6YC28IO7OLJB.pcm -fmodule-file\=iHUD\=/Users/progwhizmac3/Desktop/b4i_v5/B4iBuildServer/UploadedProjects/<user id>/build/ExplicitPrecompiledModules/iHUD-3MF46SEBGFEPLY42RZRNITZQV.pcm -fmodule-file\=iHttp\=/Users/progwhizmac3/Desktop/b4i_v5/B4iBuildServer/UploadedProjects/<user id>/build/ExplicitPrecompiledModules/iHttp-B7KDFNKZAJZ4IMKZHIWHC7NDZ.pcm -fmodule-file\=iJSON\=/Users/progwhizmac3/Desktop/b4i_v5/B4iBuildServer/UploadedProjects/<user id>/build/ExplicitPrecompiledModules/iJSON-9I2RF3T3NET232DJHLMVHBVCQ.pcm -fmodule-file\=iMedia\=/Users/progwhizmac3/Desktop/b4i_v5/B4iBuildServer/UploadedProjects/<user id>/build/ExplicitPrecompiledModules/iMedia-J86NAVOKCVA7UVXTSK2RMMBI.pcm -fmodule-file\=iNetwork\=/Users/progwhizmac3/Desktop/b4i_v5/B4iBuildServer/UploadedProjects/<user id>/build/ExplicitPrecompiledModules/iNetwork-66GSDV9IN03AXG8GSN3318Y2X.pcm -fmodule-file\=iStore\=/Users/progwhizmac3/Desktop/b4i_v5/B4iBuildServer/UploadedProjects/<user id>/build/ExplicitPrecompiledModules/iStore-4SI4A2ARKVUIF6A54JXLIAURO.pcm -fmodule-file\=iStringUtils\=/Users/progwhizmac3/Desktop/b4i_v5/B4iBuildServer/UploadedProjects/<user id>/build/ExplicitPrecompiledModules/iStringUtils-9Q98C421TLUVKAKCN6KE90AMB.pcm -fmodule-file\=iUI8\=/Users/progwhizmac3/Desktop/b4i_v5/B4iBuildServer/UploadedProjects/<user id>/build/ExplicitPrecompiledModules/iUI8-7DZHGNBYBTW0NPEIDRFMNLB5Q.pcm -fmodule-file\=iXUI\=/Users/progwhizmac3/Desktop/b4i_v5/B4iBuildServer/UploadedProjects/<user id>/build/ExplicitPrecompiledModules/iXUI-7SW54OM6IDPO4889S1Z9C7NMV.pcm -fmodule-file\=xCustomListView\=/Users/progwhizmac3/Desktop/b4i_v5/B4iBuildServer/UploadedProjects/<user id>/build/ExplicitPrecompiledModules/xCustomListView-F2THAT34UA393PVS65CMVOV3D.pcm -I /Users/progwhizmac3/Desktop/b4i_v5/B4iBuildServer/UploadedProjects/<user id>/build/B4iProject.build/Release-iphoneos/B4iProject.build/Progwhiz\ ID\ Maker-own-target-headers.hmap -I /Users/progwhizmac3/Desktop/b4i_v5/B4iBuildServer/UploadedProjects/<user id>/build/B4iProject.build/Release-iphoneos/B4iProject.build/Progwhiz\ ID\ Maker-all-target-headers.hmap -I /Users/progwhizmac3/Desktop/b4i_v5/B4iBuildServer/UploadedProjects/<user id>/Payload/include -I /Users/progwhizmac3/Desktop/b4i_v5/B4iBuildServer/UploadedProjects/<user id>/build/B4iProject.build/Release-iphoneos/B4iProject.build/DerivedSources-normal/arm64 -I /Users/progwhizmac3/Desktop/b4i_v5/B4iBuildServer/UploadedProjects/<user id>/build/B4iProject.build/Release-iphoneos/B4iProject.build/DerivedSources/arm64 -I /Users/progwhizmac3/Desktop/b4i_v5/B4iBuildServer/UploadedProjects/<user id>/build/B4iProject.build/Release-iphoneos/B4iProject.build/DerivedSources -F /Users/progwhizmac3/Desktop/b4i_v5/B4iBuildServer/UploadedProjects/<user id>/Payload -F ../../Libs -F ../../Libs/Extra -iquote /Users/progwhizmac3/Desktop/b4i_v5/B4iBuildServer/UploadedProjects/<user id>/build/B4iProject.build/Release-iphoneos/B4iProject.build/Progwhiz\ ID\ Maker-generated-files.hmap -iquote /Users/progwhizmac3/Desktop/b4i_v5/B4iBuildServer/UploadedProjects/<user id>/build/B4iProject.build/Release-iphoneos/B4iProject.build/Progwhiz\ ID\ Maker-project-headers.hmap -isystem /Applications/Xcode.app/Contents/Developer/Platforms/iPhoneOS.platform/Developer/SDKs/iPhoneOS26.2.sdk/usr/local/include -isystem /Applications/Xcode.app/Contents/Developer/Toolchains/XcodeDefault.xctoolchain/usr/lib/clang/17/include -internal-externc-isystem /Applications/Xcode.app/Contents/Developer/Platforms/iPhoneOS.platform/Developer/SDKs/iPhoneOS26.2.sdk/usr/include -internal-externc-isystem /Applications/Xcode.app/Contents/Developer/Toolchains/XcodeDefault.xctoolchain/usr/include -internal-iframework /Applications/Xcode.app/Contents/Developer/Platforms/iPhoneOS.platform/Developer/SDKs/iPhoneOS26.2.sdk/System/Library/Frameworks -internal-iframework /Applications/Xcode.app/Contents/Developer/Platforms/iPhoneOS.platform/Developer/SDKs/iPhoneOS26.2.sdk/System/Library/SubFrameworks -internal-iframework /Applications/Xcode.app/Contents/Developer/Platforms/iPhoneOS.platform/Developer/SDKs/iPhoneOS26.2.sdk/Library/Frameworks -ivfsstatcache /var/folders/x8/b9w239r53_q4jkdy_7fjmlw80000gn/C/com.apple.DeveloperTools/26.3-17C529/Xcode/SDKStatCaches.noindex/iphoneos26.2-23C57-3794476bd08197c3e2abd9bb477ef7f7.sdkstatcache -std\=gnu99 -fexceptions -fskip-odr-check-in-gmf -fmodules -fno-implicit-modules -fobjc-exceptions -fmax-type-align\=16 -fpascal-strings -fstack-check -fvisibility\=hidden -fvisibility-inlines-hidden-static-local-var -mdarwin-stkchk-strong-link -fno-odr-hash-protocols -pic-level 2 -fencode-extended-block-signature -stack-protector 1 -fobjc-runtime\=ios-16.0.0 -fobjc-arc -fobjc-runtime-has-weak -fobjc-weak -fgnuc-version\=4.2.1 -fblocks -ffp-contract\=on -fclang-abi-compat\=4.0 -fno-experimental-relative-c++-abi-vtables -fno-file-reproducible -clang-vendor-feature\=+disableNonDependentMemberExprInCurrentInstantiation -clang-vendor-feature\=+enableAggressiveVLAFolding -clang-vendor-feature\=+revert09abecef7bbf -clang-vendor-feature\=+thisNoAlignAttr -clang-vendor-feature\=+thisNoNullAttr -clang-vendor-feature\=+disableAtImportPrivateFrameworkInImplementationError -O0 -fno-assume-unique-vtables -fdebug-compilation-dir\=/Users/progwhizmac3/Desktop/b4i_v5/B4iBuildServer/UploadedProjects/<user id> -fcoverage-compilation-dir\=/Users/progwhizmac3/Desktop/b4i_v5/B4iBuildServer/UploadedProjects/<user id> -fcommon -fobjc-msgsend-selector-stubs -fregister-global-dtors-with-atexit -fno-strict-return -dwarf-version\=4 -debugger-tuning\=lldb -disable-llvm-verifier -dwarf-ext-refs -funwind-tables\=1 -clear-ast-before-backend -discard-value-names -main-file-name b4i_main.m -mframe-pointer\=non-leaf -debug-info-kind\=standalone -fdiagnostics-hotness-threshold\=0 -fdiagnostics-misexpect-tolerance\=0 -D B4I_VERSION\=16 -D NS_BLOCK_ASSERTIONS\=1 -D OBJC_OLD_DISPATCH_PROTOTYPES\=1 -D __GCC_HAVE_DWARF2_CFI_ASM\=1 -fdefine-target-os-macros -MT dependencies -dependency-file /Users/progwhizmac3/Desktop/b4i_v5/B4iBuildServer/UploadedProjects/<user id>/build/B4iProject.build/Release-iphoneos/B4iProject.build/Objects-normal/arm64/b4i_main.d -skip-unused-modulemap-deps


Error: ** BUILD FAILED **


The following build commands failed:
    CompileC /Users/progwhizmac3/Desktop/b4i_v5/B4iBuildServer/UploadedProjects/<user id>/build/B4iProject.build/Release-iphoneos/B4iProject.build/Objects-normal/arm64/b4i_main.o /Users/progwhizmac3/Desktop/b4i_v5/B4iBuildServer/UploadedProjects/<user id>/B4iProject/b4i_main.m normal arm64 objective-c com.apple.compilers.llvm.clang.1_0.compiler (in target 'B4iProject' from project 'B4iProject')
(1 failure)
 

Markos

Well-Known Member
Licensed User
Longtime User
Hi All,

I am trying to build using B4Buildserver and test my App with In-App capability. I did the following approaches from a provisioning profile creation

1) I created the profile with wildcard identifier and got this response from the server below

B4X:
B4i Version: 10.00
Parsing code.    (0.08s)
Building folders structure.    (0.03s)
Compiling code.    (0.08s)
Compiling layouts code.    (0.03s)
Building Xcode project.    (0.22s)
Preparing project for builder.    (0.26s)
    Project size: 1.70 MB
Sending data to remote compiler.    Error
Out: Command line invocation:
    /Applications/Xcode.app/Contents/Developer/usr/bin/xcodebuild -configuration Release "PRODUCT_NAME=Progwhiz ID Maker" CONFIGURATION_BUILD_DIR=/Users/progwhizmac3/Desktop/b4i_v5/B4iBuildServer/UploadedProjects/<user id>/Payload "CODE_SIGN_IDENTITY=iPhone Developer: Mark Raymond (A8QVDNS5BQ)" "OTHER_CODE_SIGN_FLAGS=--keychain <user id>" PROVISIONING_PROFILE=e9d6119e-f8c0-423f-9b23-40229e03da8d -arch arm64

Build settings from command line:
    ARCHS = arm64
    CODE_SIGN_IDENTITY = iPhone Developer: Mark Raymond (A8QVDNS5BQ)
    CONFIGURATION_BUILD_DIR = /Users/progwhizmac3/Desktop/b4i_v5/B4iBuildServer/UploadedProjects/<user id>/Payload
    OTHER_CODE_SIGN_FLAGS = --keychain <user id>
    PRODUCT_NAME = Progwhiz ID Maker
    PROVISIONING_PROFILE = e9d6119e-f8c0-423f-9b23-40229e03da8d

note: Using codesigning identity override: iPhone Developer: Mark Raymond (A8QVDNS5BQ)
ComputePackagePrebuildTargetDependencyGraph

Prepare packages

CreateBuildRequest

SendProjectDescription

CreateBuildOperation

ComputeTargetDependencyGraph
note: Building targets in dependency order
note: Target dependency graph (1 target)
    Target 'B4iProject' in project 'B4iProject' (no dependencies)

GatherProvisioningInputs

CreateBuildDescription

ExecuteExternalTool /Applications/Xcode.app/Contents/Developer/Toolchains/XcodeDefault.xctoolchain/usr/bin/clang -v -E -dM -isysroot /Applications/Xcode.app/Contents/Developer/Platforms/iPhoneOS.platform/Developer/SDKs/iPhoneOS26.2.sdk -x c -c /dev/null

ExecuteExternalTool /Applications/Xcode.app/Contents/Developer/Toolchains/XcodeDefault.xctoolchain/usr/bin/clang -v -E -dM -arch arm64 -isysroot /Applications/Xcode.app/Contents/Developer/Platforms/iPhoneOS.platform/Developer/SDKs/iPhoneOS26.2.sdk -x objective-c -c /dev/null

ExecuteExternalTool /Applications/Xcode.app/Contents/Developer/usr/bin/ibtool --version --output-format xml1

ExecuteExternalTool /Applications/Xcode.app/Contents/Developer/Toolchains/XcodeDefault.xctoolchain/usr/bin/clang -v -E -dM -arch arm64 -isysroot /Applications/Xcode.app/Contents/Developer/Platforms/iPhoneOS.platform/Developer/SDKs/iPhoneOS26.2.sdk -x c -c /dev/null

ExecuteExternalTool /Applications/Xcode.app/Contents/Developer/usr/bin/actool --print-asset-tag-combinations --output-format xml1 /Users/progwhizmac3/Desktop/b4i_v5/B4iBuildServer/UploadedProjects/<user id>/Images.xcassets

ExecuteExternalTool /Applications/Xcode.app/Contents/Developer/usr/bin/actool --version --output-format xml1

ExecuteExternalTool /Applications/Xcode.app/Contents/Developer/Toolchains/XcodeDefault.xctoolchain/usr/bin/ld -version_details

Build description signature: ce6629462571044378c1026deac44cf1
Build description path: /Users/progwhizmac3/Desktop/b4i_v5/B4iBuildServer/UploadedProjects/<user id>/build/XCBuildData/ce6629462571044378c1026deac44cf1.xcbuilddata
/Users/progwhizmac3/Desktop/b4i_v5/B4iBuildServer/UploadedProjects/<user id>/B4iProject.xcodeproj: error: Provisioning profile "ProgwhiziOSnew" doesn't include the In-App Purchase capability. (in target 'B4iProject' from project 'B4iProject')

Error: ** BUILD FAILED **

2) I tried using the explicit app identifier then I got this error below

B4X:
B4i Version: 10.00
Parsing code.    (0.08s)
Building folders structure.    (0.04s)
Compiling code.    (0.10s)
Compiling layouts code.    (0.00s)
Building Xcode project.    (0.23s)
Preparing project for builder.    (0.28s)
    Project size: 1.70 MB
Sending data to remote compiler.    Error
B4i line: 349
mainscroll.Initialize(\
invalid suffix 'x' on integer constant

Out: Command line invocation:
    /Applications/Xcode.app/Contents/Developer/usr/bin/xcodebuild -configuration Release "PRODUCT_NAME=Progwhiz ID Maker" CONFIGURATION_BUILD_DIR=/Users/progwhizmac3/Desktop/b4i_v5/B4iBuildServer/UploadedProjects/<user id>/Payload "CODE_SIGN_IDENTITY=iPhone Developer: Mark Raymond (A8QVDNS5BQ)" "OTHER_CODE_SIGN_FLAGS=--keychain <user id>" PROVISIONING_PROFILE=ae61428c-b78b-4099-829d-99e4e629d2f7 -arch arm64

Build settings from command line:
    ARCHS = arm64
    CODE_SIGN_IDENTITY = iPhone Developer: Mark Raymond (A8QVDNS5BQ)
    CONFIGURATION_BUILD_DIR = /Users/progwhizmac3/Desktop/b4i_v5/B4iBuildServer/UploadedProjects/<user id>/Payload
    OTHER_CODE_SIGN_FLAGS = --keychain <user id>
    PRODUCT_NAME = Progwhiz ID Maker
    PROVISIONING_PROFILE = ae61428c-b78b-4099-829d-99e4e629d2f7

note: Using codesigning identity override: iPhone Developer: Mark Raymond (A8QVDNS5BQ)
ComputePackagePrebuildTargetDependencyGraph

Prepare packages

CreateBuildRequest

SendProjectDescription

CreateBuildOperation

ComputeTargetDependencyGraph
note: Building targets in dependency order
note: Target dependency graph (1 target)
    Target 'B4iProject' in project 'B4iProject' (no dependencies)

GatherProvisioningInputs

CreateBuildDescription

ExecuteExternalTool /Applications/Xcode.app/Contents/Developer/Toolchains/XcodeDefault.xctoolchain/usr/bin/clang -v -E -dM -isysroot /Applications/Xcode.app/Contents/Developer/Platforms/iPhoneOS.platform/Developer/SDKs/iPhoneOS26.2.sdk -x c -c /dev/null

ExecuteExternalTool /Applications/Xcode.app/Contents/Developer/Toolchains/XcodeDefault.xctoolchain/usr/bin/clang -v -E -dM -arch arm64 -isysroot /Applications/Xcode.app/Contents/Developer/Platforms/iPhoneOS.platform/Developer/SDKs/iPhoneOS26.2.sdk -x objective-c -c /dev/null

**Skpped other output ***

    /Applications/Xcode.app/Contents/Developer/Toolchains/XcodeDefault.xctoolchain/usr/bin/clang -x objective-c -ivfsstatcache /var/folders/x8/b9w239r53_q4jkdy_7fjmlw80000gn/C/com.apple.DeveloperTools/26.3-17C529/Xcode/SDKStatCaches.noindex/iphoneos26.2-23C57-3794476bd08197c3e2abd9bb477ef7f7.sdkstatcache -fmessage-length\=0 -fdiagnostics-show-note-include-stack -fmacro-backtrace-limit\=0 -fno-color-diagnostics -fmodules-prune-interval\=86400 -fmodules-prune-after\=345600 -fbuild-session-file\=/var/folders/x8/b9w239r53_q4jkdy_7fjmlw80000gn/C/org.llvm.clang/ModuleCache.noindex/Session.modulevalidation -fmodules-validate-once-per-build-session -Wnon-modular-include-in-framework-module -Werror\=non-modular-include-in-framework-module -Wno-trigraphs -Wno-missing-field-initializers -Wno-missing-prototypes -Werror\=return-type -Wno-implicit-atomic-properties -Werror\=deprecated-objc-isa-usage -Wno-objc-interface-ivars -Werror\=objc-root-class -Wno-arc-repeated-use-of-weak -Wduplicate-method-match -Wno-missing-braces -Wparentheses -Wswitch -Wunused-function -Wno-unused-label -Wno-unused-parameter -Wunused-variable -Wunused-value -Wempty-body -Wuninitialized -Wconditional-uninitialized -Wno-unknown-pragmas -Wno-shadow -Wno-four-char-constants -Wno-conversion -Wconstant-conversion -Wint-conversion -Wbool-conversion -Wenum-conversion -Wno-float-conversion -Wno-non-literal-null-conversion -Wno-objc-literal-conversion -Wshorten-64-to-32 -Wpointer-sign -Wno-newline-eof -Wno-selector -Wno-strict-selector-match -Wundeclared-selector -Wno-deprecated-implementations -Wno-implicit-fallthrough -fstrict-aliasing -Wprotocol -Wdeprecated-declarations -Wno-sign-conversion -Wno-infinite-recursion -Wno-comma -Wno-block-capture-autoreleasing -Wno-strict-prototypes -Wno-semicolon-before-method-body @/Users/progwhizmac3/Desktop/b4i_v5/B4iBuildServer/UploadedProjects/<user id>/build/B4iProject.build/Release-iphoneos/B4iProject.build/Objects-normal/arm64/e6072d4f65d7061329687fe24e3d63a7-common-args.resp -MMD -MT dependencies -MF /Users/progwhizmac3/Desktop/b4i_v5/B4iBuildServer/UploadedProjects/<user id>/build/B4iProject.build/Release-iphoneos/B4iProject.build/Objects-normal/arm64/b4i_main.d --serialize-diagnostics /Users/progwhizmac3/Desktop/b4i_v5/B4iBuildServer/UploadedProjects/<user id>/build/B4iProject.build/Release-iphoneos/B4iProject.build/Objects-normal/arm64/b4i_main.dia -c /Users/progwhizmac3/Desktop/b4i_v5/B4iBuildServer/UploadedProjects/<user id>/B4iProject/b4i_main.m -o /Users/progwhizmac3/Desktop/b4i_v5/B4iBuildServer/UploadedProjects/<user id>/build/B4iProject.build/Release-iphoneos/B4iProject.build/Objects-normal/arm64/b4i_main.o
/Users/progwhizmac3/Desktop/b4i_v5/B4iBuildServer/UploadedProjects/<user id>/B4iProject/b4i_main.m:2365:66: error: invalid suffix 'x' on integer constant
 2365 | [self->__mainscroll Initialize:self.bi :@"mainscroll" :(int) (100x) :(int) ([self->___c PerYToCurrent:(float) (100)])];
      |                                                                  ^
/Users/progwhizmac3/Desktop/b4i_v5/B4iBuildServer/UploadedProjects/<user id>/B4iProject/b4i_main.m:5123:23: warning: initializing 'const __strong id<B4IIterable>' with an expression of incompatible type 'B4IMap *__strong'
 5123 | const id<B4IIterable> group4 = _products;
      |                       ^        ~~~~~~~~~
/Users/progwhizmac3/Desktop/b4i_v5/B4iBuildServer/UploadedProjects/<user id>/B4iProject/b4i_main.m:5304:8: warning: passing 'const void *' to parameter of type 'void * _Nullable' discards qualifiers [-Wincompatible-pointer-types-discards-qualifiers]
 5304 |        data.bytes,
      |        ^~~~~~~~~~
In module 'AVFoundation' imported from /Users/progwhizmac3/Desktop/b4i_v5/B4iBuildServer/UploadedProjects/<user id>/B4iProject/b4i_main.h:13:
In module 'CoreMedia' imported from /Applications/Xcode.app/Contents/Developer/Platforms/iPhoneOS.platform/Developer/SDKs/iPhoneOS26.2.sdk/System/Library/Frameworks/AVFoundation.framework/Headers/AVContentKeySession.h:10:
In module 'CoreGraphics' imported from /Applications/Xcode.app/Contents/Developer/Platforms/iPhoneOS.platform/Developer/SDKs/iPhoneOS26.2.sdk/System/Library/Frameworks/CoreMedia.framework/Headers/CMFormatDescription.h:27:
/Applications/Xcode.app/Contents/Developer/Platforms/iPhoneOS.platform/Developer/SDKs/iPhoneOS26.2.sdk/System/Library/Frameworks/CoreGraphics.framework/Headers/CGBitmapContext.h:77:75: note: passing argument to parameter 'data' here
   77 | CG_EXTERN CGContextRef __nullable CGBitmapContextCreate(void * __nullable data,
      |                                                                           ^
/Users/progwhizmac3/Desktop/b4i_v5/B4iBuildServer/UploadedProjects/<user id>/B4iProject/b4i_main.m:5310:5: warning: implicit conversion from enumeration type 'enum CGImageAlphaInfo' to different enumeration type 'CGBitmapInfo' (aka 'enum CGBitmapInfo') [-Wenum-conversion]
 5303 |    CGContextRef bitmapContext = CGBitmapContextCreate(
      |                                 ~~~~~~~~~~~~~~~~~~~~~
 5304 |        data.bytes,
 5305 |     width,
 5306 |     height,
 5307 |     8,
 5308 |     4*width,
 5309 |     colorSpace,
 5310 |     kCGImageAlphaNoneSkipLast);
      |     ^~~~~~~~~~~~~~~~~~~~~~~~~
3 warnings and 1 error generated.
Failed frontend command:
/Applications/Xcode.app/Contents/Developer/Toolchains/XcodeDefault.xctoolchain/usr/bin/clang -cc1 -Wundef-prefix\=TARGET_OS_ -fdiagnostics-show-note-include-stack -fmacro-backtrace-limit\=0 -ferror-limit 19 -serialize-diagnostic-file /Users/progwhizmac3/Desktop/b4i_v5/B4iBuildServer/UploadedProjects/<user id>/build/B4iProject.build/Release-iphoneos/B4iProject.build/Objects-normal/arm64/b4i_main.dia -Wdeprecated-objc-isa-usage -Werror\=deprecated-objc-isa-usage -Werror\=implicit-function-declaration -Wnon-modular-include-in-framework-module -Werror\=non-modular-include-in-framework-module -Wno-trigraphs -Wno-missing-field-initializers -Wno-missing-prototypes -Werror\=return-type -Wno-implicit-atomic-properties -Werror\=deprecated-objc-isa-usage -Wno-objc-interface-ivars -Werror\=objc-root-class -Wno-arc-repeated-use-of-weak -Wduplicate-method-match -Wno-missing-braces -Wparentheses -Wswitch -Wunused-function -Wno-unused-label -Wno-unused-parameter -Wunused-variable -Wunused-value -Wempty-body -Wuninitialized -Wconditional-uninitialized -Wno-unknown-pragmas -Wno-shadow -Wno-four-char-constants -Wno-conversion -Wconstant-conversion -Wint-conversion -Wbool-conversion -Wenum-conversion -Wno-float-conversion -Wno-non-literal-null-conversion -Wno-objc-literal-conversion -Wshorten-64-to-32 -Wpointer-sign -Wno-newline-eof -Wno-selector -Wno-strict-selector-match -Wundeclared-selector -Wno-deprecated-implementations -Wno-implicit-fallthrough -Wprotocol -Wdeprecated-declarations -Wno-sign-conversion -Wno-infinite-recursion -Wno-comma -Wno-block-capture-autoreleasing -Wno-strict-prototypes -Wno-semicolon-before-method-body -Wno-reorder-init-list -Wno-implicit-int-float-conversion -Wno-c99-designator -Wno-final-dtor-non-final-class -Wno-extra-semi-stmt -Wno-misleading-indentation -Wno-quoted-include-in-framework-header -Wno-implicit-fallthrough -Wno-enum-enum-conversion -Wno-enum-float-conversion -Wno-elaborated-enum-base -fmodule-map-file\=/Applications/Xcode.app/Contents/Developer/Platforms/iPhoneOS.platform/Developer/SDKs/iPhoneOS.sdk/System/Library/Frameworks/AVFoundation.framework/Modules/module.modulemap -fmodule-map-file\=/Users/progwhizmac3/Desktop/b4i_v5/B4iBuildServer/UploadedProjects/<user id>/Payload/iCore.framework/Modules/module.modulemap -fmodule-map-file\=/Users/progwhizmac3/Desktop/b4i_v5/B4iBuildServer/UploadedProjects/<user id>/Payload/iBarcode.framework/Modules/module.modulemap -fmodule-map-file\=/Users/progwhizmac3/Desktop/b4i_v5/B4iBuildServer/UploadedProjects/<user id>/Payload/iHUD.framework/Modules/module.modulemap -fmodule-map-file\=/Users/progwhizmac3/Desktop/b4i_v5/B4iBuildServer/UploadedProjects/<user id>/Payload/iJSON.framework/Modules/module.modulemap -fmodule-map-file\=/Users/progwhizmac3/Desktop/b4i_v5/B4iBuildServer/UploadedProjects/<user id>/Payload/iMedia.framework/Modules/module.modulemap -fmodule-map-file\=/Users/progwhizmac3/Desktop/b4i_v5/B4iBuildServer/UploadedProjects/<user id>/Payload/iNetwork.framework/Modules/module.modulemap -fmodule-map-file\=/Users/progwhizmac3/Desktop/b4i_v5/B4iBuildServer/UploadedProjects/<user id>/Payload/iStringUtils.framework/Modules/module.modulemap -fmodule-map-file\=/Users/progwhizmac3/Desktop/b4i_v5/B4iBuildServer/UploadedProjects/<user id>/Payload/iUI8.framework/Modules/module.modulemap -fmodule-map-file\=/Users/progwhizmac3/Desktop/b4i_v5/B4iBuildServer/UploadedProjects/<user id>/Payload/iXUI.framework/Modules/module.modulemap -fmodule-map-file\=/Users/progwhizmac3/Desktop/b4i_v5/B4iBuildServer/UploadedProjects/<user id>/Payload/StringLib.framework/Modules/module.modulemap -fmodule-map-file\=/Users/progwhizmac3/Desktop/b4i_v5/B4iBuildServer/UploadedProjects/<user id>/Payload/xCustomListView.framework/Modules/module.modulemap -fmodule-map-file\=/Applications/Xcode.app/Contents/Developer/Platforms/iPhoneOS.platform/Developer/SDKs/iPhoneOS.sdk/System/Library/Frameworks/StoreKit.framework/Modules/module.modulemap -fmodule-map-file\=/Users/progwhizmac3/Desktop/b4i_v5/B4iBuildServer/UploadedProjects/<user id>/Payload/iStore.framework/Modules/module.modulemap -fmodule-map-file\=/Users/progwhizmac3/Desktop/b4i_v5/B4iBuildServer/UploadedProjects/<user id>/Payload/iHttp.framework/Modules/module.modulemap -fmodule-map-file\=/Applications/Xcode.app/Contents/Developer/Platforms/iPhoneOS.platform/Developer/SDKs/iPhoneOS.sdk/System/Library/Frameworks/LocalAuthentication.framework/Modules/module.modulemap -o /Users/progwhizmac3/Desktop/b4i_v5/B4iBuildServer/UploadedProjects/<user id>/build/B4iProject.build/Release-iphoneos/B4iProject.build/Objects-normal/arm64/b4i_main.o -disable-free -emit-obj -x objective-c /Users/progwhizmac3/Desktop/b4i_v5/B4iBuildServer/UploadedProjects/<user id>/B4iProject/b4i_main.m -target-abi darwinpcs -target-cpu apple-a7 -target-feature +zcm -target-feature +zcz -target-feature +v8a -target-feature +aes -target-feature +fp-armv8 -target-feature +neon -target-feature +perfmon -target-feature +sha2 -triple arm64-apple-ios16.0.0 -target-linker-version 1230.1 -target-sdk-version\=26.2 -fmodules-validate-system-headers -fno-modulemap-allow-subdirectory-search -isysroot /Applications/Xcode.app/Contents/Developer/Platforms/iPhoneOS.platform/Developer/SDKs/iPhoneOS26.2.sdk -resource-dir /Applications/Xcode.app/Contents/Developer/Toolchains/XcodeDefault.xctoolchain/usr/lib/clang/17 -fmodule-format\=obj -fmodule-file\=AVFoundation\=/Users/progwhizmac3/Desktop/b4i_v5/B4iBuildServer/UploadedProjects/<user id>/build/ExplicitPrecompiledModules/AVFoundation-4JY7I7APY2YTKF1WCA0WDH3MA.pcm -fmodule-file\=LocalAuthentication\=/Users/progwhizmac3/Desktop/b4i_v5/B4iBuildServer/UploadedProjects/<user id>/build/ExplicitPrecompiledModules/LocalAuthentication-7D3Y1TDRBAGG2IM5PXH6LZOJY.pcm -fmodule-file\=StoreKit\=/Users/progwhizmac3/Desktop/b4i_v5/B4iBuildServer/UploadedProjects/<user id>/build/ExplicitPrecompiledModules/StoreKit-8IY15K54NJSSKLT8EYYSFU0HA.pcm -fmodule-file\=StringLib\=/Users/progwhizmac3/Desktop/b4i_v5/B4iBuildServer/UploadedProjects/<user id>/build/ExplicitPrecompiledModules/StringLib-EJ77CO1WIZ7VV7GDT03JTPSGN.pcm -fmodule-file\=iBarcode\=/Users/progwhizmac3/Desktop/b4i_v5/B4iBuildServer/UploadedProjects/<user id>/build/ExplicitPrecompiledModules/iBarcode-46YTI8U6JERC1U248YND1DEF1.pcm -fmodule-file\=iCore\=/Users/progwhizmac3/Desktop/b4i_v5/B4iBuildServer/UploadedProjects/<user id>/build/ExplicitPrecompiledModules/iCore-9FFKUEWP0XTXC6YC28IO7OLJB.pcm -fmodule-file\=iHUD\=/Users/progwhizmac3/Desktop/b4i_v5/B4iBuildServer/UploadedProjects/<user id>/build/ExplicitPrecompiledModules/iHUD-3MF46SEBGFEPLY42RZRNITZQV.pcm -fmodule-file\=iHttp\=/Users/progwhizmac3/Desktop/b4i_v5/B4iBuildServer/UploadedProjects/<user id>/build/ExplicitPrecompiledModules/iHttp-B7KDFNKZAJZ4IMKZHIWHC7NDZ.pcm -fmodule-file\=iJSON\=/Users/progwhizmac3/Desktop/b4i_v5/B4iBuildServer/UploadedProjects/<user id>/build/ExplicitPrecompiledModules/iJSON-9I2RF3T3NET232DJHLMVHBVCQ.pcm -fmodule-file\=iMedia\=/Users/progwhizmac3/Desktop/b4i_v5/B4iBuildServer/UploadedProjects/<user id>/build/ExplicitPrecompiledModules/iMedia-J86NAVOKCVA7UVXTSK2RMMBI.pcm -fmodule-file\=iNetwork\=/Users/progwhizmac3/Desktop/b4i_v5/B4iBuildServer/UploadedProjects/<user id>/build/ExplicitPrecompiledModules/iNetwork-66GSDV9IN03AXG8GSN3318Y2X.pcm -fmodule-file\=iStore\=/Users/progwhizmac3/Desktop/b4i_v5/B4iBuildServer/UploadedProjects/<user id>/build/ExplicitPrecompiledModules/iStore-4SI4A2ARKVUIF6A54JXLIAURO.pcm -fmodule-file\=iStringUtils\=/Users/progwhizmac3/Desktop/b4i_v5/B4iBuildServer/UploadedProjects/<user id>/build/ExplicitPrecompiledModules/iStringUtils-9Q98C421TLUVKAKCN6KE90AMB.pcm -fmodule-file\=iUI8\=/Users/progwhizmac3/Desktop/b4i_v5/B4iBuildServer/UploadedProjects/<user id>/build/ExplicitPrecompiledModules/iUI8-7DZHGNBYBTW0NPEIDRFMNLB5Q.pcm -fmodule-file\=iXUI\=/Users/progwhizmac3/Desktop/b4i_v5/B4iBuildServer/UploadedProjects/<user id>/build/ExplicitPrecompiledModules/iXUI-7SW54OM6IDPO4889S1Z9C7NMV.pcm -fmodule-file\=xCustomListView\=/Users/progwhizmac3/Desktop/b4i_v5/B4iBuildServer/UploadedProjects/<user id>/build/ExplicitPrecompiledModules/xCustomListView-F2THAT34UA393PVS65CMVOV3D.pcm -I /Users/progwhizmac3/Desktop/b4i_v5/B4iBuildServer/UploadedProjects/<user id>/build/B4iProject.build/Release-iphoneos/B4iProject.build/Progwhiz\ ID\ Maker-own-target-headers.hmap -I /Users/progwhizmac3/Desktop/b4i_v5/B4iBuildServer/UploadedProjects/<user id>/build/B4iProject.build/Release-iphoneos/B4iProject.build/Progwhiz\ ID\ Maker-all-target-headers.hmap -I /Users/progwhizmac3/Desktop/b4i_v5/B4iBuildServer/UploadedProjects/<user id>/Payload/include -I /Users/progwhizmac3/Desktop/b4i_v5/B4iBuildServer/UploadedProjects/<user id>/build/B4iProject.build/Release-iphoneos/B4iProject.build/DerivedSources-normal/arm64 -I /Users/progwhizmac3/Desktop/b4i_v5/B4iBuildServer/UploadedProjects/<user id>/build/B4iProject.build/Release-iphoneos/B4iProject.build/DerivedSources/arm64 -I /Users/progwhizmac3/Desktop/b4i_v5/B4iBuildServer/UploadedProjects/<user id>/build/B4iProject.build/Release-iphoneos/B4iProject.build/DerivedSources -F /Users/progwhizmac3/Desktop/b4i_v5/B4iBuildServer/UploadedProjects/<user id>/Payload -F ../../Libs -F ../../Libs/Extra -iquote /Users/progwhizmac3/Desktop/b4i_v5/B4iBuildServer/UploadedProjects/<user id>/build/B4iProject.build/Release-iphoneos/B4iProject.build/Progwhiz\ ID\ Maker-generated-files.hmap -iquote /Users/progwhizmac3/Desktop/b4i_v5/B4iBuildServer/UploadedProjects/<user id>/build/B4iProject.build/Release-iphoneos/B4iProject.build/Progwhiz\ ID\ Maker-project-headers.hmap -isystem /Applications/Xcode.app/Contents/Developer/Platforms/iPhoneOS.platform/Developer/SDKs/iPhoneOS26.2.sdk/usr/local/include -isystem /Applications/Xcode.app/Contents/Developer/Toolchains/XcodeDefault.xctoolchain/usr/lib/clang/17/include -internal-externc-isystem /Applications/Xcode.app/Contents/Developer/Platforms/iPhoneOS.platform/Developer/SDKs/iPhoneOS26.2.sdk/usr/include -internal-externc-isystem /Applications/Xcode.app/Contents/Developer/Toolchains/XcodeDefault.xctoolchain/usr/include -internal-iframework /Applications/Xcode.app/Contents/Developer/Platforms/iPhoneOS.platform/Developer/SDKs/iPhoneOS26.2.sdk/System/Library/Frameworks -internal-iframework /Applications/Xcode.app/Contents/Developer/Platforms/iPhoneOS.platform/Developer/SDKs/iPhoneOS26.2.sdk/System/Library/SubFrameworks -internal-iframework /Applications/Xcode.app/Contents/Developer/Platforms/iPhoneOS.platform/Developer/SDKs/iPhoneOS26.2.sdk/Library/Frameworks -ivfsstatcache /var/folders/x8/b9w239r53_q4jkdy_7fjmlw80000gn/C/com.apple.DeveloperTools/26.3-17C529/Xcode/SDKStatCaches.noindex/iphoneos26.2-23C57-3794476bd08197c3e2abd9bb477ef7f7.sdkstatcache -std\=gnu99 -fexceptions -fskip-odr-check-in-gmf -fmodules -fno-implicit-modules -fobjc-exceptions -fmax-type-align\=16 -fpascal-strings -fstack-check -fvisibility\=hidden -fvisibility-inlines-hidden-static-local-var -mdarwin-stkchk-strong-link -fno-odr-hash-protocols -pic-level 2 -fencode-extended-block-signature -stack-protector 1 -fobjc-runtime\=ios-16.0.0 -fobjc-arc -fobjc-runtime-has-weak -fobjc-weak -fgnuc-version\=4.2.1 -fblocks -ffp-contract\=on -fclang-abi-compat\=4.0 -fno-experimental-relative-c++-abi-vtables -fno-file-reproducible -clang-vendor-feature\=+disableNonDependentMemberExprInCurrentInstantiation -clang-vendor-feature\=+enableAggressiveVLAFolding -clang-vendor-feature\=+revert09abecef7bbf -clang-vendor-feature\=+thisNoAlignAttr -clang-vendor-feature\=+thisNoNullAttr -clang-vendor-feature\=+disableAtImportPrivateFrameworkInImplementationError -O0 -fno-assume-unique-vtables -fdebug-compilation-dir\=/Users/progwhizmac3/Desktop/b4i_v5/B4iBuildServer/UploadedProjects/<user id> -fcoverage-compilation-dir\=/Users/progwhizmac3/Desktop/b4i_v5/B4iBuildServer/UploadedProjects/<user id> -fcommon -fobjc-msgsend-selector-stubs -fregister-global-dtors-with-atexit -fno-strict-return -dwarf-version\=4 -debugger-tuning\=lldb -disable-llvm-verifier -dwarf-ext-refs -funwind-tables\=1 -clear-ast-before-backend -discard-value-names -main-file-name b4i_main.m -mframe-pointer\=non-leaf -debug-info-kind\=standalone -fdiagnostics-hotness-threshold\=0 -fdiagnostics-misexpect-tolerance\=0 -D B4I_VERSION\=16 -D NS_BLOCK_ASSERTIONS\=1 -D OBJC_OLD_DISPATCH_PROTOTYPES\=1 -D __GCC_HAVE_DWARF2_CFI_ASM\=1 -fdefine-target-os-macros -MT dependencies -dependency-file /Users/progwhizmac3/Desktop/b4i_v5/B4iBuildServer/UploadedProjects/<user id>/build/B4iProject.build/Release-iphoneos/B4iProject.build/Objects-normal/arm64/b4i_main.d -skip-unused-modulemap-deps


Error: ** BUILD FAILED **


The following build commands failed:
    CompileC /Users/progwhizmac3/Desktop/b4i_v5/B4iBuildServer/UploadedProjects/<user id>/build/B4iProject.build/Release-iphoneos/B4iProject.build/Objects-normal/arm64/b4i_main.o /Users/progwhizmac3/Desktop/b4i_v5/B4iBuildServer/UploadedProjects/<user id>/B4iProject/b4i_main.m normal arm64 objective-c com.apple.compilers.llvm.clang.1_0.compiler (in target 'B4iProject' from project 'B4iProject')
(1 failure)
Sorry my bad I assumed incorrectly it was still an In-App issue it was a foolish single typo in the code that the syntax checker didnt spot, all is good now for my build process
 
Upvote 0
Top